Target
Signal transducer and activator of transcription 1-alpha/beta
Ligand
BDBM43561
Substrate
Meas. Tech.
Dose response counterscreen assay for STAT3 activators: cell-based high throughput assay to measure STAT1 activation
EC50
>55700±n/a nM
Citation
 PubChem, PC Dose response counterscreen assay for STAT3 activators: cell-based high throughput assay to measure STAT1 activation PubChem Bioassay (2008)[AID] 
Target
Name:
Signal transducer and activator of transcription 1-alpha/beta
Synonyms:
STAT1 Signal transducer and activator of transcription 1-alpha/beta Transcription factor ISGF-3 components p91/p84 | signal transducer and activator of transcription 1 isoform alpha
Type:
Cytosolic Transcription Factor
Mol. Mass.:
87327.69
Organism:
Homo sapiens (Human)
Description:
Stat1 was expressed in sf9 cells from a baculovirus encoding the recombinant proteins. Stat1 dimer binds to DNA.
Residue:
750
  
Inhibitor
Name:
BDBM43561
Synonyms:
7-[(2-methyl-2,3-dihydroindol-1-yl)methyl]-5-thiazolo[3,2-a]pyrimidinone 7-[(2-methylindolin-1-yl)methyl]thiazolo[3,2-a]pyrimidin-5-one SMR000062957 | cid_2998666
Type:
Small organic molecule
Emp. Form.:
C16H15N3OS
Mol. Mass.:
297.375
SMILES:
CC1Cc2ccccc2N1Cc1cc(=O)n2ccsc2n1
: