Target
Signal transducer and activator of transcription 1-alpha/beta
Ligand
BDBM43569
Substrate
Meas. Tech.
Dose response counterscreen assay for STAT3 activators: cell-based high throughput assay to measure STAT1 activation
EC50
>55700±n/a nM
Citation
 PubChem, PC Dose response counterscreen assay for STAT3 activators: cell-based high throughput assay to measure STAT1 activation PubChem Bioassay (2008)[AID] 
Target
Name:
Signal transducer and activator of transcription 1-alpha/beta
Synonyms:
STAT1 Signal transducer and activator of transcription 1-alpha/beta Transcription factor ISGF-3 components p91/p84 | signal transducer and activator of transcription 1 isoform alpha
Type:
Cytosolic Transcription Factor
Mol. Mass.:
87327.69
Organism:
Homo sapiens (Human)
Description:
Stat1 was expressed in sf9 cells from a baculovirus encoding the recombinant proteins. Stat1 dimer binds to DNA.
Residue:
750
  
Inhibitor
Name:
BDBM43569
Synonyms:
MLS000087216 N-(4-chloro-2,5-dimethoxy-phenyl)-5-(2-furyl)isoxazole-3-carboxamide N-(4-chloro-2,5-dimethoxyphenyl)-5-(2-furyl)isoxazole-3-carboxamide SMR000023439 | cid_3243301
Type:
Small organic molecule
Emp. Form.:
C16H13ClN2O5
Mol. Mass.:
348.738
SMILES:
COc1cc(NC(=O)c2cc(on2)-c2ccco2)c(OC)cc1Cl
: