Target
Signal transducer and activator of transcription 1-alpha/beta
Ligand
BDBM43578
Substrate
Meas. Tech.
Dose response counterscreen assay for STAT3 activators: cell-based high throughput assay to measure STAT1 activation
EC50
>55700±n/a nM
Citation
 PubChem, PC Dose response counterscreen assay for STAT3 activators: cell-based high throughput assay to measure STAT1 activation PubChem Bioassay (2008)[AID] 
Target
Name:
Signal transducer and activator of transcription 1-alpha/beta
Synonyms:
STAT1 Signal transducer and activator of transcription 1-alpha/beta Transcription factor ISGF-3 components p91/p84 | signal transducer and activator of transcription 1 isoform alpha
Type:
Cytosolic Transcription Factor
Mol. Mass.:
87327.69
Organism:
Homo sapiens (Human)
Description:
Stat1 was expressed in sf9 cells from a baculovirus encoding the recombinant proteins. Stat1 dimer binds to DNA.
Residue:
750
  
Inhibitor
Name:
BDBM43578
Synonyms:
3-(5-bromanylfuran-2-yl)-5-(5-chloranyl-2-methoxy-phenyl)-1,2,4-oxadiazole 3-(5-bromo-2-furyl)-5-(5-chloro-2-methoxy-phenyl)-1,2,4-oxadiazole MLS000119204 cid_1517735
Type:
Small organic molecule
Emp. Form.:
C13H8BrClN2O3
Mol. Mass.:
355.571
SMILES:
COc1ccc(Cl)cc1-c1nc(no1)-c1ccc(Br)o1
: