Target
Signal transducer and activator of transcription 1-alpha/beta
Ligand
BDBM43580
Substrate
Meas. Tech.
Dose response counterscreen assay for STAT3 activators: cell-based high throughput assay to measure STAT1 activation
EC50
>55700±n/a nM
Citation
 PubChem, PC Dose response counterscreen assay for STAT3 activators: cell-based high throughput assay to measure STAT1 activation PubChem Bioassay (2008)[AID] 
Target
Name:
Signal transducer and activator of transcription 1-alpha/beta
Synonyms:
STAT1 Signal transducer and activator of transcription 1-alpha/beta Transcription factor ISGF-3 components p91/p84 | signal transducer and activator of transcription 1 isoform alpha
Type:
Cytosolic Transcription Factor
Mol. Mass.:
87327.69
Organism:
Homo sapiens (Human)
Description:
Stat1 was expressed in sf9 cells from a baculovirus encoding the recombinant proteins. Stat1 dimer binds to DNA.
Residue:
750
  
Inhibitor
Name:
BDBM43580
Synonyms:
5-(3,5-dimethylpiperidin-1-yl)sulfonyl-3-methyl-N-(pyridin-3-ylmethyl)-1-benzofuran-2-carboxamide 5-[(3,5-dimethyl-1-piperidinyl)sulfonyl]-3-methyl-N-(3-pyridinylmethyl)-2-benzofurancarboxamide SMR000093119 | cid_5307875
Type:
Small organic molecule
Emp. Form.:
C23H27N3O4S
Mol. Mass.:
441.543
SMILES:
CC1CC(C)CN(C1)S(=O)(=O)c1ccc2oc(C(=O)NCc3cccnc3)c(C)c2c1
: