Target
Signal transducer and activator of transcription 1-alpha/beta
Ligand
BDBM43587
Substrate
Meas. Tech.
Dose response counterscreen assay for STAT3 activators: cell-based high throughput assay to measure STAT1 activation
EC50
21560±n/a nM
Citation
 PubChem, PC Dose response counterscreen assay for STAT3 activators: cell-based high throughput assay to measure STAT1 activation PubChem Bioassay (2008)[AID] 
Target
Name:
Signal transducer and activator of transcription 1-alpha/beta
Synonyms:
STAT1 Signal transducer and activator of transcription 1-alpha/beta Transcription factor ISGF-3 components p91/p84 | signal transducer and activator of transcription 1 isoform alpha
Type:
Cytosolic Transcription Factor
Mol. Mass.:
87327.69
Organism:
Homo sapiens (Human)
Description:
Stat1 was expressed in sf9 cells from a baculovirus encoding the recombinant proteins. Stat1 dimer binds to DNA.
Residue:
750
  
Inhibitor
Name:
BDBM43587
Synonyms:
3-(4-chlorophenyl)-1-methyl-N-(3-pyrrolidin-1-ylpropyl)thieno[2,3-c]pyrazole-5-carboxamide 3-(4-chlorophenyl)-1-methyl-N-[3-(1-pyrrolidinyl)propyl]-5-thieno[2,3-c]pyrazolecarboxamide SMR000094250 | cid_5308376
Type:
Small organic molecule
Emp. Form.:
C20H23ClN4OS
Mol. Mass.:
402.941
SMILES:
Cn1nc(-c2ccc(Cl)cc2)c2cc(sc12)C(=O)NCCCN1CCCC1
: