Target
Signal transducer and activator of transcription 1-alpha/beta
Ligand
BDBM43600
Substrate
Meas. Tech.
Dose response counterscreen assay for STAT3 activators: cell-based high throughput assay to measure STAT1 activation
EC50
>55700±n/a nM
Citation
 PubChem, PC Dose response counterscreen assay for STAT3 activators: cell-based high throughput assay to measure STAT1 activation PubChem Bioassay (2008)[AID] 
Target
Name:
Signal transducer and activator of transcription 1-alpha/beta
Synonyms:
STAT1 Signal transducer and activator of transcription 1-alpha/beta Transcription factor ISGF-3 components p91/p84 | signal transducer and activator of transcription 1 isoform alpha
Type:
Cytosolic Transcription Factor
Mol. Mass.:
87327.69
Organism:
Homo sapiens (Human)
Description:
Stat1 was expressed in sf9 cells from a baculovirus encoding the recombinant proteins. Stat1 dimer binds to DNA.
Residue:
750
  
Inhibitor
Name:
BDBM43600
Synonyms:
1-(5-bromanylpyridin-2-yl)-3-(5-chloranyl-2-methoxy-phenyl)urea 1-(5-bromo-2-pyridyl)-3-(5-chloro-2-methoxy-phenyl)urea MLS000537841 SMR000144081 | cid_1296656
Type:
Small organic molecule
Emp. Form.:
C13H11BrClN3O2
Mol. Mass.:
356.602
SMILES:
COc1ccc(Cl)cc1NC(=O)Nc1ccc(Br)cn1
: