Target
Signal transducer and activator of transcription 1-alpha/beta
Ligand
BDBM43602
Substrate
Meas. Tech.
Dose response counterscreen assay for STAT3 activators: cell-based high throughput assay to measure STAT1 activation
EC50
>55700±n/a nM
Citation
 PubChem, PC Dose response counterscreen assay for STAT3 activators: cell-based high throughput assay to measure STAT1 activation PubChem Bioassay (2008)[AID] 
Target
Name:
Signal transducer and activator of transcription 1-alpha/beta
Synonyms:
STAT1 Signal transducer and activator of transcription 1-alpha/beta Transcription factor ISGF-3 components p91/p84 | signal transducer and activator of transcription 1 isoform alpha
Type:
Cytosolic Transcription Factor
Mol. Mass.:
87327.69
Organism:
Homo sapiens (Human)
Description:
Stat1 was expressed in sf9 cells from a baculovirus encoding the recombinant proteins. Stat1 dimer binds to DNA.
Residue:
750
  
Inhibitor
Name:
BDBM43602
Synonyms:
MLS000520930 SMR000131339 cycloheptyl(1H-indol-3-ylmethyl)amine
Type:
Small organic molecule
Emp. Form.:
C16H22N2
Mol. Mass.:
242.3593
SMILES:
C(NC1CCCCCC1)c1c[nH]c2ccccc12
: