Target
Signal transducer and activator of transcription 1-alpha/beta
Ligand
BDBM43638
Substrate
Meas. Tech.
Dose response counterscreen assay for STAT3 activators: cell-based high throughput assay to measure STAT1 activation
EC50
>55700±n/a nM
Citation
 PubChem, PC Dose response counterscreen assay for STAT3 activators: cell-based high throughput assay to measure STAT1 activation PubChem Bioassay (2008)[AID] 
Target
Name:
Signal transducer and activator of transcription 1-alpha/beta
Synonyms:
STAT1 Signal transducer and activator of transcription 1-alpha/beta Transcription factor ISGF-3 components p91/p84 | signal transducer and activator of transcription 1 isoform alpha
Type:
Cytosolic Transcription Factor
Mol. Mass.:
87327.69
Organism:
Homo sapiens (Human)
Description:
Stat1 was expressed in sf9 cells from a baculovirus encoding the recombinant proteins. Stat1 dimer binds to DNA.
Residue:
750
  
Inhibitor
Name:
BDBM43638
Synonyms:
MLS000735578 N-[3-[1-(3-chlorophenyl)-1,3,4,9-tetrahydropyrido[3,4-b]indol-2-yl]-3-oxidanylidene-propyl]ethanamide NoName cid_16191734
Type:
Small organic molecule
Emp. Form.:
C22H22ClN3O2
Mol. Mass.:
395.882
SMILES:
CC(=O)NCCC(=O)N1CCc2c([nH]c3ccccc23)C1c1cccc(Cl)c1
: