Target
Wee1-like protein kinase
Ligand
BDBM25469
Substrate
Meas. Tech.
Dose Response Cell-based Assay for Inhibitors of Wee1 Degradation
EC50
>1842±n/a nM
Citation
 PubChem, PC Dose Response Cell-based Assay for Inhibitors of Wee1 Degradation PubChem Bioassay (2008)[AID] 
Target
Name:
Wee1-like protein kinase
Synonyms:
Serine/threonine-protein kinase WEE1 WEE1 homolog (S. pombe) | WEE1_HUMAN
Type:
PROTEIN
Mol. Mass.:
71599.12
Organism:
Homo sapiens (Human)
Description:
ChEMBL_1445054
Residue:
646
  
Inhibitor
Name:
BDBM25469
Synonyms:
2-[(7-nitro-2,1,3-benzoxadiazol-4-yl)sulfanyl]-1-oxidopyridin-1-ium cid_313619
Type:
Small organic molecule
Emp. Form.:
C11H6N4O4S
Mol. Mass.:
290.255
SMILES:
[O-][N+](=O)c1ccc(Sc2cccc[n+]2[O-])c2nonc12
: