Target
G2/mitotic-specific cyclin-B1
Ligand
BDBM43758
Substrate
Meas. Tech.
Counterscreen assay for inhibitors of Wee1 degradation: dose response cell-based assay to identify inhibitors of cyclin B degradation
EC50
>49750±n/a nM
Citation
 PubChem, PC Counterscreen assay for inhibitors of Wee1 degradation: dose response cell-based assay to identify inhibitors of cyclin B degradation PubChem Bioassay (2008)[AID] 
Target
Name:
G2/mitotic-specific cyclin-B1
Synonyms:
CCNB CCNB1_HUMAN
Type:
Enzyme Subunit
Mol. Mass.:
48340.95
Organism:
Homo sapiens (Human)
Description:
P14635
Residue:
433
  
Inhibitor
Name:
BDBM43758
Synonyms:
1-[(E)-3-(4-methoxyphenyl)-1-oxoprop-2-enyl]-4-piperidinecarboxylic acid methyl ester MLS000535204 cid_2162384 methyl 1-[3-(4-methoxyphenyl)acryloyl]-4-piperidinecarboxylate
Type:
Small organic molecule
Emp. Form.:
C17H21NO4
Mol. Mass.:
303.3529
SMILES:
COC(=O)C1CCN(CC1)C(=O)\C=C\c1ccc(OC)cc1
: