Target
G2/mitotic-specific cyclin-B1
Ligand
BDBM25469
Substrate
Meas. Tech.
Counterscreen assay for inhibitors of Wee1 degradation: dose response cell-based assay to identify inhibitors of cyclin B degradation
EC50
>49750±n/a nM
Citation
 PubChem, PC Counterscreen assay for inhibitors of Wee1 degradation: dose response cell-based assay to identify inhibitors of cyclin B degradation PubChem Bioassay (2008)[AID] 
Target
Name:
G2/mitotic-specific cyclin-B1
Synonyms:
CCNB CCNB1_HUMAN
Type:
Enzyme Subunit
Mol. Mass.:
48340.95
Organism:
Homo sapiens (Human)
Description:
P14635
Residue:
433
  
Inhibitor
Name:
BDBM25469
Synonyms:
2-[(7-nitro-2,1,3-benzoxadiazol-4-yl)sulfanyl]-1-oxidopyridin-1-ium cid_313619
Type:
Small organic molecule
Emp. Form.:
C11H6N4O4S
Mol. Mass.:
290.255
SMILES:
[O-][N+](=O)c1ccc(Sc2cccc[n+]2[O-])c2nonc12
: