Target
Alkaline phosphatase, tissue-nonspecific isozyme
Ligand
BDBM43789
Substrate
Meas. Tech.
SAR assay for compounds activating TNAP in the absence of phosphate acceptor performed in a luminescent assay
EC50
18200±n/a nM
Citation
 PubChem, PC SAR assay for compounds activating TNAP in the absence of phosphate acceptor performed in a luminescent assay PubChem Bioassay (2010)[AID] 
Target
Name:
Alkaline phosphatase, tissue-nonspecific isozyme
Synonyms:
ALPL tissue-nonspecific alkaline phosphatase precursor
Type:
PROTEIN
Mol. Mass.:
57306.17
Organism:
Homo sapiens (Human)
Description:
ChEMBL_1448917
Residue:
524
  
Inhibitor
Name:
BDBM43789
Synonyms:
3-phenyl-N-(1H-1,2,4-triazol-5-yl)propanamide MLS-0052784.0001 | cid_839995
Type:
Small organic molecule
Emp. Form.:
C11H12N4O
Mol. Mass.:
216.2392
SMILES:
O=C(CCc1ccccc1)Nc1nnc[nH]1
: