Target
Phosphotransferase
Ligand
BDBM43832
Substrate
Meas. Tech.
Inhibition Assay
Temperature
298.15±0 K
Ki
1.9e+4± 5e+2 nM
IC50
400000±0.0 nM
Citation
 Willson, MSanejouand, YHPerie, JHannaert, VOpperdoes, F Sequencing, modeling, and selective inhibition of Trypanosoma brucei hexokinase. Chem Biol 9:839-47 (2002)  
Target
Name:
Phosphotransferase
Synonyms:
Hexokinase
Type:
Protein
Mol. Mass.:
51306.14
Organism:
Trypanosoma brucei
Description:
Q38C42
Residue:
471
  
Inhibitor
Name:
BDBM43832
Synonyms:
2-phenylcyclopropane-1,1-dicarboxylic acid diethyl ester MLS000326954 cid_258820 diethyl 2-phenylcyclopropane-1,1-dicarboxylate
Type:
Small organic molecule
Emp. Form.:
C15H18O4
Mol. Mass.:
262.301
SMILES:
CCOC(=O)C1(CC1c1ccccc1)C(=O)OCC
: