Target
Solute carrier family 12 member 5
Ligand
BDBM43887
Substrate
Meas. Tech.
Identification of Novel Modulators of Cl- dependent Transport Process via HTS: Dose-Dependent Assay 2 with KCC2
EC50
31100±n/a nM
Citation
 PubChem, PC Identification of Novel Modulators of Cl- dependent Transport Process via HTS: Dose-Dependent Assay 2 with KCC2 PubChem Bioassay (2009)[AID] 
Target
Name:
Solute carrier family 12 member 5
Synonyms:
Electroneutral potassium-chloride cotransporter 2 KCC2 Neuronal K-Cl cotransporter SLC12A5 electroneutral potassium-chloride cotransporter KCC2 | hKCC2
Type:
PROTEIN
Mol. Mass.:
126185.18
Organism:
Homo sapiens (Human)
Description:
ChEMBL_828024
Residue:
1139
  
Inhibitor
Name:
BDBM43887
Synonyms:
(6E)-6-[(1,3-benzoxazol-2-ylhydrazo)methylidene]-1-cyclohexa-2,4-dienone (6E)-6-[[N'-(1,3-benzoxazol-2-yl)hydrazino]methylene]cyclohexa-2,4-dien-1-one MLS000777673 cid_10037895
Type:
Small organic molecule
Emp. Form.:
C14H11N3O2
Mol. Mass.:
253.256
SMILES:
Oc1ccccc1CN=Nc1nc2ccccc2o1
: