Target
Solute carrier family 12 member 5
Ligand
BDBM43889
Substrate
Meas. Tech.
Identification of Novel Modulators of Cl- dependent Transport Process via HTS: Dose-Dependent Assay 2 with KCC2
EC50
6100±n/a nM
Citation
 PubChem, PC Identification of Novel Modulators of Cl- dependent Transport Process via HTS: Dose-Dependent Assay 2 with KCC2 PubChem Bioassay (2009)[AID] 
Target
Name:
Solute carrier family 12 member 5
Synonyms:
Electroneutral potassium-chloride cotransporter 2 KCC2 Neuronal K-Cl cotransporter SLC12A5 electroneutral potassium-chloride cotransporter KCC2 | hKCC2
Type:
PROTEIN
Mol. Mass.:
126185.18
Organism:
Homo sapiens (Human)
Description:
ChEMBL_828024
Residue:
1139
  
Inhibitor
Name:
BDBM43889
Synonyms:
4-(2,3-dihydrobenzo[b]furan-5-yl)pyrimidine-2-thiol 6-(2,3-dihydrobenzofuran-5-yl)-1H-pyrimidine-2-thione MLS000860737 cid_2821359
Type:
Small organic molecule
Emp. Form.:
C12H10N2OS
Mol. Mass.:
230.286
SMILES:
S=c1nc(cc[nH]1)-c1ccc2OCCc2c1
: