Target
Solute carrier family 12 member 5
Ligand
BDBM43894
Substrate
Meas. Tech.
Identification of Novel Modulators of Cl- dependent Transport Process via HTS: Rubidium Flux
IC50
6000±n/a nM
Citation
 PubChem, PC Identification of Novel Modulators of Cl- dependent Transport Process via HTS: Rubidium Flux PubChem Bioassay (2009)[AID] 
Target
Name:
Solute carrier family 12 member 5
Synonyms:
Electroneutral potassium-chloride cotransporter 2 KCC2 Neuronal K-Cl cotransporter SLC12A5 electroneutral potassium-chloride cotransporter KCC2 | hKCC2
Type:
PROTEIN
Mol. Mass.:
126185.18
Organism:
Homo sapiens (Human)
Description:
ChEMBL_828024
Residue:
1139
  
Inhibitor
Name:
BDBM43894
Synonyms:
3-benzyl-6-[2-(3,4-dihydro-2H-quinolin-1-yl)-2-keto-ethyl]triazolo[4,5-d]pyrimidin-7-one 6-[2-(3,4-dihydro-2H-quinolin-1-yl)-2-oxidanylidene-ethyl]-3-(phenylmethyl)-[1,2,3]triazolo[4,5-d]pyrimidin-7-one VU0286105-2-D7 | cid_5310194
Type:
Small organic molecule
Emp. Form.:
C22H20N6O2
Mol. Mass.:
400.4332
SMILES:
O=C(Cn1cnc2n(Cc3ccccc3)nnc2c1=O)N1CCCc2ccccc12
: