Target
Solute carrier family 12 member 5
Ligand
BDBM43895
Substrate
Meas. Tech.
Identification of Novel Modulators of Cl- dependent Transport Process via HTS: Rubidium Flux
IC50
300±n/a nM
Citation
 PubChem, PC Identification of Novel Modulators of Cl- dependent Transport Process via HTS: Rubidium Flux PubChem Bioassay (2009)[AID] 
Target
Name:
Solute carrier family 12 member 5
Synonyms:
Electroneutral potassium-chloride cotransporter 2 KCC2 Neuronal K-Cl cotransporter SLC12A5 electroneutral potassium-chloride cotransporter KCC2 | hKCC2
Type:
PROTEIN
Mol. Mass.:
126185.18
Organism:
Homo sapiens (Human)
Description:
ChEMBL_828024
Residue:
1139
  
Inhibitor
Name:
BDBM43895
Synonyms:
6-(4-ethoxyphenyl)-8-[(E)-2-phenylethenyl]-3,4a,7a,8-tetrahydropyrrolo[2,3]thiopyrano[4,5-b][1,3]thiazole-2,5,7-trione 6-p-phenetyl-8-[(E)-styryl]-3,4a,7a,8-tetrahydropyrrolo[2,3]thiopyrano[4,5-b]thiazole-2,5,7-trione cid_5293297
Type:
Small organic molecule
Emp. Form.:
C24H20N2O4S2
Mol. Mass.:
464.557
SMILES:
CCOc1ccc(cc1)-n1c(O)c2Sc3[nH]c(=O)sc3C(C=Cc3ccccc3)c2c1O
: