Target
Solute carrier family 12 member 5
Ligand
BDBM18864
Substrate
Meas. Tech.
Identification of Novel Modulators of Cl- dependent Transport Process via HTS; Dose-dependent Assay with KCC2
EC50
11100±n/a nM
Citation
 PubChem, PC Identification of Novel Modulators of Cl- dependent Transport Process via HTS; Dose-dependent Assay with KCC2 PubChem Bioassay (2009)[AID] 
Target
Name:
Solute carrier family 12 member 5
Synonyms:
Electroneutral potassium-chloride cotransporter 2 KCC2 Neuronal K-Cl cotransporter SLC12A5 electroneutral potassium-chloride cotransporter KCC2 | hKCC2
Type:
PROTEIN
Mol. Mass.:
126185.18
Organism:
Homo sapiens (Human)
Description:
ChEMBL_828024
Residue:
1139
  
Inhibitor
Name:
BDBM18864
Synonyms:
3-[4-(4-hydroxy-3-iodophenoxy)-3,5-diiodophenyl]propanoic acid cid_5804 | triiodothyropropionic acid, 5
Type:
Small organic molecule
Emp. Form.:
C15H11I3O4
Mol. Mass.:
635.9589
SMILES:
OC(=O)CCc1cc(I)c(Oc2ccc(O)c(I)c2)c(I)c1
: