Target
E3 ubiquitin-protein ligase XIAP
Ligand
BDBM44254
Substrate
Meas. Tech.
SAR analysis of Antagonists of IAP-family anti-apoptotic proteins
IC50
16800±6500 nM
Citation
 PubChem, PC SAR analysis of Antagonists of IAP-family anti-apoptotic proteins PubChem Bioassay (2009)[AID] 
Target
Name:
E3 ubiquitin-protein ligase XIAP
Synonyms:
API3 E3 ubiquitin-protein ligase XIAP Inhibitor of apoptosis protein 3 X-linked inhibitor of apoptosis XIAP | XIAP_HUMAN
Type:
Protein
Mol. Mass.:
56685.27
Organism:
Homo sapiens (Human)
Description:
P98170
Residue:
497
  
Inhibitor
Name:
BDBM44254
Synonyms:
MLS-0390866.0001 | cid_25181204
Type:
Small organic molecule
Emp. Form.:
C73H96F6N10O12
Mol. Mass.:
1419.5936
SMILES:
OC(=O)C(F)(F)F.OC(=O)C(F)(F)F.CNC(C)C(=O)NC(C1CCCCC1)C(=O)N1CCCC1C(=O)NC(C(c1ccccc1)c1ccccc1)C(=O)NCCCCCNC(=O)C(NC(=O)C1CCCN1C(=O)C(NC(=O)C(C)NC)C1CCCCC1)C(c1ccccc1)c1ccccc1
: