Target
E3 ubiquitin-protein ligase XIAP
Ligand
BDBM44268
Substrate
Meas. Tech.
SAR analysis of Antagonists of IAP-family anti-apoptotic proteins
IC50
9700±1900 nM
Citation
 PubChem, PC SAR analysis of Antagonists of IAP-family anti-apoptotic proteins PubChem Bioassay (2009)[AID] 
Target
Name:
E3 ubiquitin-protein ligase XIAP
Synonyms:
API3 E3 ubiquitin-protein ligase XIAP Inhibitor of apoptosis protein 3 X-linked inhibitor of apoptosis XIAP | XIAP_HUMAN
Type:
Protein
Mol. Mass.:
56685.27
Organism:
Homo sapiens (Human)
Description:
P98170
Residue:
497
  
Inhibitor
Name:
BDBM44268
Synonyms:
MLS-0391001.0001 formic acid;(2S)-1-[(2S)-2-[[(2S)-2-(methylamino)-1-oxopropyl]amino]-1-oxobutyl]-N-(1,2,3,4-tetrahydronaphthalen-1-yl)-2-pyrrolidinecarboxamide formic acid;(2S)-1-[(2S)-2-[[(2S)-2-(methylamino)propanoyl]amino]butanoyl]-N-tetralin-1-yl-pyrrolidine-2-carboxamide | methanoic acid;(2S)-1-[(2S)-2-[[(2S)-2-(methylamino)propanoyl]amino]butanoyl]-N-(1,2,3,4-tetrahydronaphthalen-1-yl)pyrrolidine-2-carboxamide
Type:
Small organic molecule
Emp. Form.:
C23H34N4O3
Mol. Mass.:
414.5411
SMILES:
CC[C@H](NC(=O)[C@H](C)NC)C(=O)N1CCC[C@H]1C(=O)NC1CCCc2ccccc12
: