Target
E3 ubiquitin-protein ligase XIAP
Ligand
BDBM44295
Substrate
Meas. Tech.
SAR analysis of Antagonists of IAP-family anti-apoptotic proteins
IC50
1400±100 nM
Citation
 PubChem, PC SAR analysis of Antagonists of IAP-family anti-apoptotic proteins PubChem Bioassay (2009)[AID] 
Target
Name:
E3 ubiquitin-protein ligase XIAP
Synonyms:
API3 E3 ubiquitin-protein ligase XIAP Inhibitor of apoptosis protein 3 X-linked inhibitor of apoptosis XIAP | XIAP_HUMAN
Type:
Protein
Mol. Mass.:
56685.27
Organism:
Homo sapiens (Human)
Description:
P98170
Residue:
497
  
Inhibitor
Name:
BDBM44295
Synonyms:
CHEMBL1624713 cid_44182162 formic acid;(2S)-1-[(2S)-3-methyl-2-[[(2S)-2-(methylamino)propanoyl]amino]butanoyl]-N-(1-naphthyl)pyrrolidine-2-carboxamide methanoic acid;(2S)-1-[(2S)-3-methyl-2-[[(2S)-2-(methylamino)propanoyl]amino]butanoyl]-N-naphthalen-1-yl-pyrrolidine-2-carboxamide
Type:
Small organic molecule
Emp. Form.:
C24H32N4O3
Mol. Mass.:
424.5359
SMILES:
CN[C@@H](C)C(=O)N[C@@H](C(C)C)C(=O)N1CCC[C@H]1C(=O)Nc1cccc2ccccc12
: