Target
E3 ubiquitin-protein ligase XIAP
Ligand
BDBM44302
Substrate
Meas. Tech.
SAR analysis of Antagonists of IAP-family anti-apoptotic proteins
IC50
7200±800 nM
Citation
 PubChem, PC SAR analysis of Antagonists of IAP-family anti-apoptotic proteins PubChem Bioassay (2009)[AID] 
Target
Name:
E3 ubiquitin-protein ligase XIAP
Synonyms:
API3 E3 ubiquitin-protein ligase XIAP Inhibitor of apoptosis protein 3 X-linked inhibitor of apoptosis XIAP | XIAP_HUMAN
Type:
Protein
Mol. Mass.:
56685.27
Organism:
Homo sapiens (Human)
Description:
P98170
Residue:
497
  
Inhibitor
Name:
BDBM44302
Synonyms:
(2S)-5-(diaminomethylideneamino)-2-[[(2S)-3-methyl-2-[[(2S)-2-(methylamino)-1-oxopropyl]amino]-1-oxobutyl]amino]-N-(1,2,3,4-tetrahydronaphthalen-1-yl)pentanamide;formic acid (2S)-5-[bis(azanyl)methylideneamino]-2-[[(2S)-3-methyl-2-[[(2S)-2-(methylamino)propanoyl]amino]butanoyl]amino]-N-(1,2,3,4-tetrahydronaphthalen-1-yl)pentanamide;methanoic acid cid_44182177 | formic acid;(2S)-5-guanidino-2-[[(2S)-3-methyl-2-[[(2S)-2-(methylamino)propanoyl]amino]butanoyl]amino]-N-tetralin-1-yl-valeramide
Type:
Small organic molecule
Emp. Form.:
C25H41N7O3
Mol. Mass.:
487.6381
SMILES:
[#6]-[#7]-[#6@@H](-[#6])-[#6](=O)-[#7]-[#6@@H](-[#6](-[#6])-[#6])-[#6](=O)-[#7]-[#6@@H](-[#6]-[#6]-[#6]\[#7]=[#6](\[#7])-[#7])-[#6](=O)-[#7]-[#6]-1-[#6]-[#6]-[#6]-c2ccccc-12
: