Target
E3 ubiquitin-protein ligase XIAP
Ligand
BDBM44306
Substrate
Meas. Tech.
SAR analysis of Antagonists of IAP-family anti-apoptotic proteins
IC50
11700±1200 nM
Citation
 PubChem, PC SAR analysis of Antagonists of IAP-family anti-apoptotic proteins PubChem Bioassay (2009)[AID] 
Target
Name:
E3 ubiquitin-protein ligase XIAP
Synonyms:
API3 E3 ubiquitin-protein ligase XIAP Inhibitor of apoptosis protein 3 X-linked inhibitor of apoptosis XIAP | XIAP_HUMAN
Type:
Protein
Mol. Mass.:
56685.27
Organism:
Homo sapiens (Human)
Description:
P98170
Residue:
497
  
Inhibitor
Name:
BDBM44306
Synonyms:
(2S)-N-[(1S)-2-[(4-bromo-1-naphthyl)amino]-2-keto-1-methyl-ethyl]-3-methyl-2-[[(2S)-2-(methylamino)propanoyl]amino]butyramide;formic acid (2S)-N-[(2S)-1-[(4-bromo-1-naphthalenyl)amino]-1-oxopropan-2-yl]-3-methyl-2-[[(2S)-2-(methylamino)-1-oxopropyl]amino]butanamide;formic acid MLS-0412069.0001 | cid_44182185
Type:
Small organic molecule
Emp. Form.:
C22H29BrN4O3
Mol. Mass.:
477.395
SMILES:
CN[C@@H](C)C(=O)N[C@@H](C(C)C)C(=O)N[C@@H](C)C(=O)Nc1ccc(Br)c2ccccc12
: