Target
E3 ubiquitin-protein ligase XIAP
Ligand
BDBM44317
Substrate
Meas. Tech.
SAR analysis of Antagonists of IAP-family anti-apoptotic proteins
IC50
5300±300 nM
Citation
 PubChem, PC SAR analysis of Antagonists of IAP-family anti-apoptotic proteins PubChem Bioassay (2009)[AID] 
Target
Name:
E3 ubiquitin-protein ligase XIAP
Synonyms:
API3 E3 ubiquitin-protein ligase XIAP Inhibitor of apoptosis protein 3 X-linked inhibitor of apoptosis XIAP | XIAP_HUMAN
Type:
Protein
Mol. Mass.:
56685.27
Organism:
Homo sapiens (Human)
Description:
P98170
Residue:
497
  
Inhibitor
Name:
BDBM44317
Synonyms:
MLS-0412152.0001 formic acid;(2S)-3-methyl-2-[[(2S)-2-(methylamino)-1-oxopropyl]amino]-N-[(2S)-1-oxo-1-(1,2,3,4-tetrahydronaphthalen-2-ylamino)propan-2-yl]butanamide formic acid;(2S)-N-[(1S)-2-keto-1-methyl-2-(tetralin-2-ylamino)ethyl]-3-methyl-2-[[(2S)-2-(methylamino)propanoyl]amino]butyramide | methanoic acid;(2S)-3-methyl-2-[[(2S)-2-(methylamino)propanoyl]amino]-N-[(2S)-1-oxidanylidene-1-(1,2,3,4-tetrahydronaphthalen-2-ylamino)propan-2-yl]butanamide
Type:
Small organic molecule
Emp. Form.:
C22H34N4O3
Mol. Mass.:
402.5304
SMILES:
CN[C@@H](C)C(=O)N[C@@H](C(C)C)C(=O)N[C@@H](C)C(=O)NC1CCc2ccccc2C1
: