Target
E3 ubiquitin-protein ligase XIAP
Ligand
BDBM44343
Substrate
Meas. Tech.
SAR analysis of Antagonists of IAP-family anti-apoptotic proteins
IC50
73800±9800 nM
Citation
 PubChem, PC SAR analysis of Antagonists of IAP-family anti-apoptotic proteins PubChem Bioassay (2009)[AID] 
Target
Name:
E3 ubiquitin-protein ligase XIAP
Synonyms:
API3 E3 ubiquitin-protein ligase XIAP Inhibitor of apoptosis protein 3 X-linked inhibitor of apoptosis XIAP | XIAP_HUMAN
Type:
Protein
Mol. Mass.:
56685.27
Organism:
Homo sapiens (Human)
Description:
P98170
Residue:
497
  
Inhibitor
Name:
BDBM44343
Synonyms:
(2S)-N-[(1S)-1-(4,5-diphenyl-1,3-oxazol-2-yl)ethyl]-3-methyl-2-[[(2S)-2-(methylamino)propanoyl]amino]butanamide;formic acid (2S)-N-[(1S)-1-(4,5-diphenyl-2-oxazolyl)ethyl]-3-methyl-2-[[(2S)-2-(methylamino)-1-oxopropyl]amino]butanamide;formic acid MLS-0412181.0001 | cid_44229010
Type:
Small organic molecule
Emp. Form.:
C26H32N4O3
Mol. Mass.:
448.5573
SMILES:
CN[C@@H](C)C(=O)N[C@@H](C(C)C)C(=O)N[C@@H](C)c1nc(c(o1)-c1ccccc1)-c1ccccc1
: