Target
E3 ubiquitin-protein ligase XIAP
Ligand
BDBM44362
Substrate
Meas. Tech.
SAR analysis of Antagonists of XIAP-Bir3 domain of IAP-family anti-apoptotic proteins
IC50
67100±2600 nM
Citation
 PubChem, PC SAR analysis of Antagonists of XIAP-Bir3 domain of IAP-family anti-apoptotic proteins PubChem Bioassay (2009)[AID] 
Target
Name:
E3 ubiquitin-protein ligase XIAP
Synonyms:
API3 E3 ubiquitin-protein ligase XIAP Inhibitor of apoptosis protein 3 X-linked inhibitor of apoptosis XIAP | XIAP_HUMAN
Type:
Protein
Mol. Mass.:
56685.27
Organism:
Homo sapiens (Human)
Description:
P98170
Residue:
497
  
Inhibitor
Name:
BDBM44362
Synonyms:
MLS-0390984.0001 formic acid;(2S)-1-[(2R)-3-methyl-2-[[(2S)-2-(methylamino)-1-oxopropyl]amino]-1-oxobutyl]-N-(2-pyridinylmethyl)-2-pyrrolidinecarboxamide formic acid;(2S)-1-[(2R)-3-methyl-2-[[(2S)-2-(methylamino)propanoyl]amino]butanoyl]-N-(pyridin-2-ylmethyl)pyrrolidine-2-carboxamide | methanoic acid;(2S)-1-[(2R)-3-methyl-2-[[(2S)-2-(methylamino)propanoyl]amino]butanoyl]-N-(pyridin-2-ylmethyl)pyrrolidine-2-carboxamide
Type:
Small organic molecule
Emp. Form.:
C20H31N5O3
Mol. Mass.:
389.4918
SMILES:
CN[C@@H](C)C(=O)N[C@H](C(C)C)C(=O)N1CCC[C@H]1C(=O)NCc1ccccn1
: