Target
Tumor necrosis factor ligand superfamily member 10
Ligand
BDBM44376
Substrate
Meas. Tech.
SAR analysis of compounds that potentiate TRAIL-induced apoptosis in PPC-1 cells.
IC50
>10000±n/a nM
Citation
 PubChem, PC SAR analysis of compounds that potentiate TRAIL-induced apoptosis in PPC-1 cells. PubChem Bioassay (2009)[AID] 
Target
Name:
Tumor necrosis factor ligand superfamily member 10
Synonyms:
APO2L TNFSF10 tumor necrosis factor (ligand) superfamily, member 10
Type:
PROTEIN
Mol. Mass.:
32511.55
Organism:
Homo sapiens (Human)
Description:
EBI_101343
Residue:
281
  
Inhibitor
Name:
BDBM44376
Synonyms:
2-(methylthio)-4,6-diphenyl-1,3,5-triazine 2-methylsulfanyl-4,6-diphenyl-1,3,5-triazine cid_12909
Type:
Small organic molecule
Emp. Form.:
C16H13N3S
Mol. Mass.:
279.36
SMILES:
CSc1nc(nc(n1)-c1ccccc1)-c1ccccc1
: