Target
Alkaline phosphatase, tissue-nonspecific isozyme
Ligand
BDBM34565
Substrate
Meas. Tech.
TNAP luminescent HTS assay
IC50
5250±410 nM
Citation
 PubChem, PC TNAP luminescent HTS assay PubChem Bioassay (2008)[AID] 
Target
Name:
Alkaline phosphatase, tissue-nonspecific isozyme
Synonyms:
ALPL tissue-nonspecific alkaline phosphatase precursor
Type:
PROTEIN
Mol. Mass.:
57306.17
Organism:
Homo sapiens (Human)
Description:
ChEMBL_1448917
Residue:
524
  
Inhibitor
Name:
BDBM34565
Synonyms:
6-Amino-4-(4-hydroxy-3,5-dimethoxy-phenyl)-3-methoxymethyl-2,4-dihydro-pyrano[2,3-c]pyrazole-5-carbonitrile 6-amino-4-(4-hydroxy-3,5-dimethoxyphenyl)-3-(methoxymethyl)-2,4-dihydropyrano[2,3-c]pyrazole-5-carbonitrile MLS000033666 cid_647209
Type:
Small organic molecule
Emp. Form.:
C17H18N4O5
Mol. Mass.:
358.3486
SMILES:
COCc1n[nH]c2OC(=N)C(C#N)C(c12)c1cc(OC)c(O)c(OC)c1
: