Target
Alkaline phosphatase, tissue-nonspecific isozyme
Ligand
BDBM4303
Substrate
Meas. Tech.
TNAP luminescent HTS assay
IC50
5160±220 nM
Citation
 PubChem, PC TNAP luminescent HTS assay PubChem Bioassay (2008)[AID] 
Target
Name:
Alkaline phosphatase, tissue-nonspecific isozyme
Synonyms:
ALPL tissue-nonspecific alkaline phosphatase precursor
Type:
PROTEIN
Mol. Mass.:
57306.17
Organism:
Homo sapiens (Human)
Description:
ChEMBL_1448917
Residue:
524
  
Inhibitor
Name:
BDBM4303
Synonyms:
(2E)-2-cyano-3-(3,4-dihydroxyphenyl)-N-(3-phenylpropyl)prop-2-enamide (E)-2-cyano-3-(3,4-dihydroxyphenyl)-N-(3-phenylpropyl)acrylamide (E)-3-[3,4-bis(oxidanyl)phenyl]-2-cyano-N-(3-phenylpropyl)prop-2-enamide MLS000069704 TYRPHOSTIN AG 555 cid_5328770
Type:
Small organic molecule
Emp. Form.:
C19H18N2O3
Mol. Mass.:
322.3578
SMILES:
Oc1ccc(\C=C(/C#N)C(=O)NCCCc2ccccc2)cc1O
: