Target
Alkaline phosphatase, tissue-nonspecific isozyme
Ligand
BDBM44409
Substrate
Meas. Tech.
TNAP luminescent HTS assay
IC50
>100000±0 nM
Citation
 PubChem, PC TNAP luminescent HTS assay PubChem Bioassay (2008)[AID] 
Target
Name:
Alkaline phosphatase, tissue-nonspecific isozyme
Synonyms:
ALPL tissue-nonspecific alkaline phosphatase precursor
Type:
PROTEIN
Mol. Mass.:
57306.17
Organism:
Homo sapiens (Human)
Description:
ChEMBL_1448917
Residue:
524
  
Inhibitor
Name:
BDBM44409
Synonyms:
1-(2-fluorophenyl)-4-{[4-(1H-pyrrol-1-yl)phenyl]acetyl}piperazine 1-[4-(2-fluorophenyl)piperazin-1-yl]-2-(4-pyrrol-1-ylphenyl)ethanone MLS000047177 cid_3243883
Type:
Small organic molecule
Emp. Form.:
C22H22FN3O
Mol. Mass.:
363.428
SMILES:
Fc1ccccc1N1CCN(CC1)C(=O)Cc1ccc(cc1)-n1cccc1
: