Target
Alkaline phosphatase, tissue-nonspecific isozyme
Ligand
BDBM44415
Substrate
Meas. Tech.
TNAP luminescent HTS assay
IC50
>100000±0 nM
Citation
 PubChem, PC TNAP luminescent HTS assay PubChem Bioassay (2008)[AID] 
Target
Name:
Alkaline phosphatase, tissue-nonspecific isozyme
Synonyms:
ALPL tissue-nonspecific alkaline phosphatase precursor
Type:
PROTEIN
Mol. Mass.:
57306.17
Organism:
Homo sapiens (Human)
Description:
ChEMBL_1448917
Residue:
524
  
Inhibitor
Name:
BDBM44415
Synonyms:
MLS000065061 N-(5-cyclohexyl-1H-1,2,4-triazol-3-yl)cyclohexanecarboxamide cid_974048
Type:
Small organic molecule
Emp. Form.:
C15H24N4O
Mol. Mass.:
276.3773
SMILES:
O=C(Nc1nnc([nH]1)C1CCCCC1)C1CCCCC1
: