Target
Alkaline phosphatase, tissue-nonspecific isozyme
Ligand
BDBM44417
Substrate
Meas. Tech.
TNAP luminescent HTS assay
IC50
>100000±0 nM
Citation
 PubChem, PC TNAP luminescent HTS assay PubChem Bioassay (2008)[AID] 
Target
Name:
Alkaline phosphatase, tissue-nonspecific isozyme
Synonyms:
ALPL tissue-nonspecific alkaline phosphatase precursor
Type:
PROTEIN
Mol. Mass.:
57306.17
Organism:
Homo sapiens (Human)
Description:
ChEMBL_1448917
Residue:
524
  
Inhibitor
Name:
BDBM44417
Synonyms:
1-(1,3-benzodioxol-5-yl)-N-[[3-(4-bromophenyl)-6-thiazolo[2,3-c][1,2,4]triazolyl]methyl]methanamine MLS000116434 [3-(4-bromophenyl)thiazolo[2,3-c][1,2,4]triazol-6-yl]methyl-piperonyl-amine | cid_4648656
Type:
Small organic molecule
Emp. Form.:
C19H15BrN4O2S
Mol. Mass.:
443.317
SMILES:
Brc1ccc(cc1)-c1nnc2sc(CNCc3ccc4OCOc4c3)cn12
: