Target
Alkaline phosphatase, tissue-nonspecific isozyme
Ligand
BDBM44424
Substrate
Meas. Tech.
TNAP luminescent HTS assay
IC50
2390±170 nM
Citation
 PubChem, PC TNAP luminescent HTS assay PubChem Bioassay (2008)[AID] 
Target
Name:
Alkaline phosphatase, tissue-nonspecific isozyme
Synonyms:
ALPL tissue-nonspecific alkaline phosphatase precursor
Type:
PROTEIN
Mol. Mass.:
57306.17
Organism:
Homo sapiens (Human)
Description:
ChEMBL_1448917
Residue:
524
  
Inhibitor
Name:
BDBM44424
Synonyms:
3,4,5-trimethoxy-N-(5-phenyl-1H-pyrazol-3-yl)benzamide SMR000102984 | cid_1378646
Type:
Small organic molecule
Emp. Form.:
C19H19N3O4
Mol. Mass.:
353.3719
SMILES:
COc1cc(cc(OC)c1OC)C(=O)Nc1cc(n[nH]1)-c1ccccc1
: