Target
Ephrin type-A receptor 4
Ligand
BDBM44444
Substrate
Meas. Tech.
Colorimetric assay for HTS discovery of chemical inhibitors of EphA4 receptor antagonists
IC50
>100000±n/a nM
Citation
 PubChem, PC Colorimetric assay for HTS discovery of chemical inhibitors of EphA4 receptor antagonists PubChem Bioassay (2008)[AID] 
Target
Name:
Ephrin type-A receptor 4
Synonyms:
EPHA4_MOUSE Epha4 Sek1
Type:
Enzyme Catalytic Domain
Mol. Mass.:
109812.17
Organism:
Mus musculus
Description:
gi_34328113
Residue:
986
  
Inhibitor
Name:
BDBM44444
Synonyms:
1-[2-[(4-methylphenyl)methylamino]-2-oxidanylidene-ethyl]piperidine-4-carboxamide 1-[2-[(4-methylphenyl)methylamino]-2-oxoethyl]piperidine-4-carboxamide MLS000097505 cid_2106397
Type:
Small organic molecule
Emp. Form.:
C16H23N3O2
Mol. Mass.:
289.3727
SMILES:
Cc1ccc(CNC(=O)CN2CCC(CC2)C(N)=O)cc1
: