Target
Ephrin type-A receptor 4
Ligand
BDBM44474
Substrate
Meas. Tech.
Colorimetric assay for HTS discovery of chemical inhibitors of EphA4 receptor antagonists
IC50
16600±n/a nM
Citation
 PubChem, PC Colorimetric assay for HTS discovery of chemical inhibitors of EphA4 receptor antagonists PubChem Bioassay (2008)[AID] 
Target
Name:
Ephrin type-A receptor 4
Synonyms:
EPHA4_MOUSE Epha4 Sek1
Type:
Enzyme Catalytic Domain
Mol. Mass.:
109812.17
Organism:
Mus musculus
Description:
gi_34328113
Residue:
986
  
Inhibitor
Name:
BDBM44474
Synonyms:
MLS000555438 SMR000147155 | cid_3757772
Type:
Small organic molecule
Emp. Form.:
C33H27N7O
Mol. Mass.:
537.6138
SMILES:
CC(=O)Nc1ccc(NC2=Nc3ccccc3N3C(c4c(C)nn(c4N=C23)-c2ccccc2)c2ccccc2)cc1
: