Target
Ephrin type-A receptor 4
Ligand
BDBM44497
Substrate
Meas. Tech.
Colorimetric assay for HTS discovery of chemical inhibitors of EphA4 receptor antagonists
IC50
4620±n/a nM
Citation
 PubChem, PC Colorimetric assay for HTS discovery of chemical inhibitors of EphA4 receptor antagonists PubChem Bioassay (2008)[AID] 
Target
Name:
Ephrin type-A receptor 4
Synonyms:
EPHA4_MOUSE Epha4 Sek1
Type:
Enzyme Catalytic Domain
Mol. Mass.:
109812.17
Organism:
Mus musculus
Description:
gi_34328113
Residue:
986
  
Inhibitor
Name:
BDBM44497
Synonyms:
6-(5-ethylsulfanyl-1,3,4-oxadiazol-2-yl)-3,4-diphenyl-thieno[2,3-c]pyridazin-5-amine 6-[5-(ethylsulfanyl)-1,3,4-oxadiazol-2-yl]-3,4-diphenylthieno[2,3-c]pyridazin-5-amine MLS000545814 [6-[5-(ethylthio)-1,3,4-oxadiazol-2-yl]-3,4-diphenyl-thieno[2,3-c]pyridazin-5-yl]amine | cid_6406850
Type:
Small organic molecule
Emp. Form.:
C22H17N5OS2
Mol. Mass.:
431.533
SMILES:
CCSc1nnc(o1)-c1sc2nnc(-c3ccccc3)c(-c3ccccc3)c2c1N
: