Target
Ephrin type-A receptor 4
Ligand
BDBM44498
Substrate
Meas. Tech.
Colorimetric assay for HTS discovery of chemical inhibitors of EphA4 receptor antagonists
IC50
1450±n/a nM
Citation
 PubChem, PC Colorimetric assay for HTS discovery of chemical inhibitors of EphA4 receptor antagonists PubChem Bioassay (2008)[AID] 
Target
Name:
Ephrin type-A receptor 4
Synonyms:
EPHA4_MOUSE Epha4 Sek1
Type:
Enzyme Catalytic Domain
Mol. Mass.:
109812.17
Organism:
Mus musculus
Description:
gi_34328113
Residue:
986
  
Inhibitor
Name:
BDBM44498
Synonyms:
2-Chloro-5-{5-[5-cyano-2-hydroxy-4-methyl-6-oxo-6H-pyridin-(3Z)-ylidenemethyl]-furan-2-yl}-benzoic acid allyl ester 2-chloro-5-[5-[(Z)-(5-cyano-4-methyl-2,6-dioxo-3-pyridinylidene)methyl]-2-furanyl]benzoic acid prop-2-enyl ester SMR000121342 prop-2-enyl 2-chloranyl-5-[5-[(Z)-[5-cyano-4-methyl-2,6-bis(oxidanylidene)pyridin-3-ylidene]methyl]furan-2-yl]benzoate | prop-2-enyl 2-chloro-5-[5-[(Z)-(5-cyano-4-methyl-2,6-dioxopyridin-3-ylidene)methyl]furan-2-yl]benzoate
Type:
Small organic molecule
Emp. Form.:
C22H15ClN2O5
Mol. Mass.:
422.818
SMILES:
CC1=C(C#N)C(=O)NC(=O)\C1=C/c1ccc(o1)-c1ccc(Cl)c(c1)C(=O)OCC=C
: