Target
Ephrin type-A receptor 4
Ligand
BDBM44525
Substrate
Meas. Tech.
Colorimetric assay for HTS discovery of chemical inhibitors of EphA4 receptor antagonists
IC50
13800±n/a nM
Citation
 PubChem, PC Colorimetric assay for HTS discovery of chemical inhibitors of EphA4 receptor antagonists PubChem Bioassay (2008)[AID] 
Target
Name:
Ephrin type-A receptor 4
Synonyms:
EPHA4_MOUSE Epha4 Sek1
Type:
Enzyme Catalytic Domain
Mol. Mass.:
109812.17
Organism:
Mus musculus
Description:
gi_34328113
Residue:
986
  
Inhibitor
Name:
BDBM44525
Synonyms:
(2E)-2-(2-pyridinylhydrazinylidene)-1-naphthalenone (2E)-2-(pyridin-2-ylhydrazinylidene)naphthalen-1-one MLS000573813 cid_5718138
Type:
Small organic molecule
Emp. Form.:
C15H11N3O
Mol. Mass.:
249.2673
SMILES:
Oc1c(ccc2ccccc12)N=Nc1ccccn1
: