Target
Ephrin type-A receptor 4
Ligand
BDBM44532
Substrate
Meas. Tech.
Colorimetric assay for HTS discovery of chemical inhibitors of EphA4 receptor antagonists
IC50
>100000±n/a nM
Citation
 PubChem, PC Colorimetric assay for HTS discovery of chemical inhibitors of EphA4 receptor antagonists PubChem Bioassay (2008)[AID] 
Target
Name:
Ephrin type-A receptor 4
Synonyms:
EPHA4_MOUSE Epha4 Sek1
Type:
Enzyme Catalytic Domain
Mol. Mass.:
109812.17
Organism:
Mus musculus
Description:
gi_34328113
Residue:
986
  
Inhibitor
Name:
BDBM44532
Synonyms:
3-[(5Z)-4-keto-5-[(E)-3-phenylprop-2-enylidene]-2-thioxo-thiazolidin-3-yl]-N-thiazol-2-yl-propionamide 3-[(5Z)-4-oxo-5-[(E)-3-phenylprop-2-enylidene]-2-sulfanylidene-1,3-thiazolidin-3-yl]-N-(1,3-thiazol-2-yl)propanamide 3-[4-oxo-5-(3-phenyl-2-propen-1-ylidene)-2-thioxo-1,3-thiazolidin-3-yl]-N-1,3-thiazol-2-ylpropanamide SMR000196419 | cid_1321247
Type:
Small organic molecule
Emp. Form.:
C18H15N3O2S3
Mol. Mass.:
401.526
SMILES:
O=C(CCN1C(=S)S\C(=C/C=C/c2ccccc2)C1=O)Nc1nccs1
: