Target
Ephrin type-A receptor 4
Ligand
BDBM44428
Substrate
Meas. Tech.
Counter Screen for Placental Alkaline Phosphatase-based Assays Positives
IC50
>50000±0 nM
Citation
 PubChem, PC Counter Screen for Placental Alkaline Phosphatase-based Assays Positives PubChem Bioassay (2008)[AID] 
Target
Name:
Ephrin type-A receptor 4
Synonyms:
EPHA4_MOUSE Epha4 Sek1
Type:
Enzyme Catalytic Domain
Mol. Mass.:
109812.17
Organism:
Mus musculus
Description:
gi_34328113
Residue:
986
  
Inhibitor
Name:
BDBM44428
Synonyms:
2-(4-Ethyl-5-o-tolyloxymethyl-4H-[1,2,4]triazol-3-ylsulfanyl)-N-(5-methyl-isoxazol-3-yl)-acetamide 2-[[4-ethyl-5-[(2-methylphenoxy)methyl]-1,2,4-triazol-3-yl]sulfanyl]-N-(5-methyl-1,2-oxazol-3-yl)ethanamide 2-[[4-ethyl-5-[(2-methylphenoxy)methyl]-1,2,4-triazol-3-yl]thio]-N-(5-methylisoxazol-3-yl)acetamide SMR000002790 | cid_651184
Type:
Small organic molecule
Emp. Form.:
C18H21N5O3S
Mol. Mass.:
387.456
SMILES:
CCn1c(COc2ccccc2C)nnc1SCC(=O)Nc1cc(C)on1
: