Target
Ephrin type-A receptor 4
Ligand
BDBM44435
Substrate
Meas. Tech.
Counter Screen for Placental Alkaline Phosphatase-based Assays Positives
IC50
>50000±0 nM
Citation
 PubChem, PC Counter Screen for Placental Alkaline Phosphatase-based Assays Positives PubChem Bioassay (2008)[AID] 
Target
Name:
Ephrin type-A receptor 4
Synonyms:
EPHA4_MOUSE Epha4 Sek1
Type:
Enzyme Catalytic Domain
Mol. Mass.:
109812.17
Organism:
Mus musculus
Description:
gi_34328113
Residue:
986
  
Inhibitor
Name:
BDBM44435
Synonyms:
2-cyano-2-[3-(3-methyl-1-piperidinyl)-2-quinoxalinyl]acetic acid cyclohexyl ester MLS000040157 cid_662746 cyclohexyl 2-cyano-2-[3-(3-methylpiperidin-1-yl)quinoxalin-2-yl]ethanoate
Type:
Small organic molecule
Emp. Form.:
C23H28N4O2
Mol. Mass.:
392.494
SMILES:
CC1CCCN(C1)c1nc2ccccc2nc1C(C#N)C(=O)OC1CCCCC1
: