Target
Ephrin type-A receptor 4
Ligand
BDBM44439
Substrate
Meas. Tech.
Counter Screen for Placental Alkaline Phosphatase-based Assays Positives
IC50
>50000±0 nM
Citation
 PubChem, PC Counter Screen for Placental Alkaline Phosphatase-based Assays Positives PubChem Bioassay (2008)[AID] 
Target
Name:
Ephrin type-A receptor 4
Synonyms:
EPHA4_MOUSE Epha4 Sek1
Type:
Enzyme Catalytic Domain
Mol. Mass.:
109812.17
Organism:
Mus musculus
Description:
gi_34328113
Residue:
986
  
Inhibitor
Name:
BDBM44439
Synonyms:
2-(3-pyrrolidin-1-ylquinoxalin-2-yl)-2-thiophen-2-ylsulfonyl-ethanenitrile 2-(3-pyrrolidinoquinoxalin-2-yl)-2-(2-thienylsulfonyl)acetonitrile MLS000042133 cid_667182
Type:
Small organic molecule
Emp. Form.:
C18H16N4O2S2
Mol. Mass.:
384.475
SMILES:
O=S(=O)(C(C#N)c1nc2ccccc2nc1N1CCCC1)c1cccs1
: