Target
Ephrin type-A receptor 4
Ligand
BDBM44455
Substrate
Meas. Tech.
Counter Screen for Placental Alkaline Phosphatase-based Assays Positives
IC50
>50000±0 nM
Citation
 PubChem, PC Counter Screen for Placental Alkaline Phosphatase-based Assays Positives PubChem Bioassay (2008)[AID] 
Target
Name:
Ephrin type-A receptor 4
Synonyms:
EPHA4_MOUSE Epha4 Sek1
Type:
Enzyme Catalytic Domain
Mol. Mass.:
109812.17
Organism:
Mus musculus
Description:
gi_34328113
Residue:
986
  
Inhibitor
Name:
BDBM44455
Synonyms:
(4Z)-4-[(E)-3-(2-furanyl)prop-2-enylidene]-2-(propylthio)-5-thiazolone (4Z)-4-[(E)-3-(furan-2-yl)prop-2-enylidene]-2-propylsulfanyl-1,3-thiazol-5-one SMR000109947 | cid_2184820
Type:
Small organic molecule
Emp. Form.:
C13H13NO2S2
Mol. Mass.:
279.378
SMILES:
CCCSC1=N\C(=C/C=C/c2ccco2)C(=O)S1
: