Target
Ephrin type-A receptor 4
Ligand
BDBM44469
Substrate
Meas. Tech.
Counter Screen for Placental Alkaline Phosphatase-based Assays Positives
IC50
>50000±0 nM
Citation
 PubChem, PC Counter Screen for Placental Alkaline Phosphatase-based Assays Positives PubChem Bioassay (2008)[AID] 
Target
Name:
Ephrin type-A receptor 4
Synonyms:
EPHA4_MOUSE Epha4 Sek1
Type:
Enzyme Catalytic Domain
Mol. Mass.:
109812.17
Organism:
Mus musculus
Description:
gi_34328113
Residue:
986
  
Inhibitor
Name:
BDBM44469
Synonyms:
2,3-bis(2-furanyl)-N-(2-phenylethyl)-6-quinoxalinecarboxamide 2,3-bis(furan-2-yl)-N-(2-phenylethyl)quinoxaline-6-carboxamide SMR000131061 | cid_5076888
Type:
Small organic molecule
Emp. Form.:
C25H19N3O3
Mol. Mass.:
409.4367
SMILES:
O=C(NCCc1ccccc1)c1ccc2nc(-c3ccco3)c(nc2c1)-c1ccco1
: