Target
Ephrin type-A receptor 4
Ligand
BDBM44476
Substrate
Meas. Tech.
Counter Screen for Placental Alkaline Phosphatase-based Assays Positives
IC50
>50000±0 nM
Citation
 PubChem, PC Counter Screen for Placental Alkaline Phosphatase-based Assays Positives PubChem Bioassay (2008)[AID] 
Target
Name:
Ephrin type-A receptor 4
Synonyms:
EPHA4_MOUSE Epha4 Sek1
Type:
Enzyme Catalytic Domain
Mol. Mass.:
109812.17
Organism:
Mus musculus
Description:
gi_34328113
Residue:
986
  
Inhibitor
Name:
BDBM44476
Synonyms:
2-[Ethyl-(4-furan-2-yl-9-methylsulfanyl-2,3-dihydro-1H-6-thia-5,8,10-triaza-cyclopenta[c]fluoren-7-yl)-ami no]-ethanol SMR000148838 | cid_4435646
Type:
Small organic molecule
Emp. Form.:
C21H22N4O2S2
Mol. Mass.:
426.555
SMILES:
CCN(CCO)c1nc(SC)nc2c1sc1nc(-c3ccco3)c3CCCc3c21
: