Target
Ephrin type-A receptor 4
Ligand
BDBM44506
Substrate
Meas. Tech.
Counter Screen for Placental Alkaline Phosphatase-based Assays Positives
IC50
>50000±0 nM
Citation
 PubChem, PC Counter Screen for Placental Alkaline Phosphatase-based Assays Positives PubChem Bioassay (2008)[AID] 
Target
Name:
Ephrin type-A receptor 4
Synonyms:
EPHA4_MOUSE Epha4 Sek1
Type:
Enzyme Catalytic Domain
Mol. Mass.:
109812.17
Organism:
Mus musculus
Description:
gi_34328113
Residue:
986
  
Inhibitor
Name:
BDBM44506
Synonyms:
1-Benzyl-3-(2-nitro-vinyl)-1H-indole 1-benzyl-3-[(E)-2-nitrovinyl]indole MLS000563269 cid_826461
Type:
Small organic molecule
Emp. Form.:
C17H14N2O2
Mol. Mass.:
278.3053
SMILES:
[O-][N+](=O)\C=C\c1cn(Cc2ccccc2)c2ccccc12
: