Target
Ephrin type-A receptor 4
Ligand
BDBM32287
Substrate
Meas. Tech.
Counter Screen for Placental Alkaline Phosphatase-based Assays Positives
IC50
>50000±0 nM
Citation
 PubChem, PC Counter Screen for Placental Alkaline Phosphatase-based Assays Positives PubChem Bioassay (2008)[AID] 
Target
Name:
Ephrin type-A receptor 4
Synonyms:
EPHA4_MOUSE Epha4 Sek1
Type:
Enzyme Catalytic Domain
Mol. Mass.:
109812.17
Organism:
Mus musculus
Description:
gi_34328113
Residue:
986
  
Inhibitor
Name:
BDBM32287
Synonyms:
(5E)-5-[[5-(2-chlorophenyl)-2-furanyl]methylidene]-3-(2-oxolanylmethyl)-2-sulfanylidene-4-thiazolidinone (5E)-5-[[5-(2-chlorophenyl)furan-2-yl]methylidene]-3-(oxolan-2-ylmethyl)-2-sulfanylidene-1,3-thiazolidin-4-one MLS000568719 cid_5759067
Type:
Small organic molecule
Emp. Form.:
C19H16ClNO3S2
Mol. Mass.:
405.918
SMILES:
Clc1ccccc1-c1ccc(\C=C2\SC(=S)N(CC3CCCO3)C2=O)o1
: