Target
Ephrin type-A receptor 4
Ligand
BDBM44529
Substrate
Meas. Tech.
Counter Screen for Placental Alkaline Phosphatase-based Assays Positives
IC50
>50000±0 nM
Citation
 PubChem, PC Counter Screen for Placental Alkaline Phosphatase-based Assays Positives PubChem Bioassay (2008)[AID] 
Target
Name:
Ephrin type-A receptor 4
Synonyms:
EPHA4_MOUSE Epha4 Sek1
Type:
Enzyme Catalytic Domain
Mol. Mass.:
109812.17
Organism:
Mus musculus
Description:
gi_34328113
Residue:
986
  
Inhibitor
Name:
BDBM44529
Synonyms:
2-chloranyl-5-nitro-N-(5,6,7,8-tetrahydronaphthalen-1-yl)benzamide 2-chloro-5-nitro-N-(5,6,7,8-tetrahydronaphthalen-1-yl)benzamide MLS000573321 cid_881056
Type:
Small organic molecule
Emp. Form.:
C17H15ClN2O3
Mol. Mass.:
330.766
SMILES:
[O-][N+](=O)c1ccc(Cl)c(c1)C(=O)Nc1cccc2CCCCc12
: