Target
Protein Rev [8-24]
Ligand
BDBM34178
Substrate
Meas. Tech.
Dose response biochemical assay to identify inhibitors of the HIV Rev - RRE RNA interaction (disruption of protein-RNA interaction)
IC50
>79370±n/a nM
Citation
 PubChem, PC Dose response biochemical assay to identify inhibitors of the HIV Rev - RRE RNA interaction (disruption of protein-RNA interaction) PubChem Bioassay (2007)[AID] 
Target
Name:
Protein Rev [8-24]
Synonyms:
Chain B, Rna Aptamer Complexed With Hiv-1 Rev Peptide, Nmr, 7 Structures rev
Type:
Enzyme Catalytic Domain
Mol. Mass.:
2446.81
Organism:
Human immunodeficiency virus 1
Description:
gi_253722402
Residue:
17
TRQARRNRRRRWRERQR
  
Inhibitor
Name:
BDBM34178
Synonyms:
6-(2,6-dimethoxyphenyl)-3-(3-phenyl-1H-pyrazol-5-yl)-[1,2,4]triazolo[3,4-b][1,3,4]thiadiazole SMR000046592 | cid_665493
Type:
Small organic molecule
Emp. Form.:
C20H16N6O2S
Mol. Mass.:
404.445
SMILES:
COc1cccc(OC)c1-c1nn2c(nnc2s1)-c1cc(n[nH]1)-c1ccccc1
: