Target
Protein Rev [8-24]
Ligand
BDBM40727
Substrate
Meas. Tech.
Dose response biochemical assay to identify inhibitors of the HIV Rev - RRE RNA interaction (disruption of protein-RNA interaction)
IC50
>79370±n/a nM
Citation
 PubChem, PC Dose response biochemical assay to identify inhibitors of the HIV Rev - RRE RNA interaction (disruption of protein-RNA interaction) PubChem Bioassay (2007)[AID] 
Target
Name:
Protein Rev [8-24]
Synonyms:
Chain B, Rna Aptamer Complexed With Hiv-1 Rev Peptide, Nmr, 7 Structures rev
Type:
Enzyme Catalytic Domain
Mol. Mass.:
2446.81
Organism:
Human immunodeficiency virus 1
Description:
gi_253722402
Residue:
17
TRQARRNRRRRWRERQR
  
Inhibitor
Name:
BDBM40727
Synonyms:
MLS000537135 N-[(4-fluorobenzylidene)amino]-2-(2-furyl)cinchoninamide N-[(4-fluorophenyl)methylideneamino]-2-(furan-2-yl)quinoline-4-carboxamide cid_1226487
Type:
Small organic molecule
Emp. Form.:
C21H14FN3O2
Mol. Mass.:
359.3532
SMILES:
Fc1ccc(C=NNC(=O)c2cc(nc3ccccc23)-c2ccco2)cc1
: